{"text_format":"1","workbook":"xlsx","n_sheets":11,"sheets":["Inputs","Impacts","Options","TripGen","TruckImpacts","TruckDistribution","RoadwayConstants","RoadwayCalcs","BridgeConstants","BridgeCalcs","OtherRoadway"],"not_rendered":{"charts":0,"images":0,"macros":1,"external_links":0,"defined_names":19,"comments":0,"pivot_tables":0},"unopened":[],"bounds":{"document_bytes":16777216,"sheet_cells":100000,"rows_first":2000,"rows_last":500,"rows_between":2000,"halvings":0,"cell_chars":16384,"cell_head_chars":4096},"cells_cut":0,"cells_raw":0,"read":"whole","date_system":"1900"}

{"sheet":"Inputs","index":0,"n_rows":110,"n_cols":9,"rows_kept":110,"cut":false,"hidden":false,"merged":[[75,6,75,7],[6,6,6,8],[14,6,14,8],[58,6,58,7],[63,6,63,7],[35,6,35,8],[37,6,37,8],[39,6,39,8],[48,6,48,8]]}
["CDOT Oil & Gas Impacts Calculator"]
["Created by Felsburg Holt & Ullevig for exclusive use by CDOT"]
["v1.2","Last updated on 3/2/2015"]
["Roadway Information"]
[]
["SEGMENT:",1]
["Q1.","Name of the roadway:"]
[]
["Q2.","Start Mile Post:"]
[]
["Q3.","End Mile Post:"]
[]
["Q4.","CDOT Region:",null,null,null,null,"R1"]
[]
["Q5.","Functional Class:",null,null,null,null,"Interstate"]
[]
["Q6.","Urban or Rural?:",null,null,null,null,"Urban"]
[]
["Q7.","Mountains or Plains?:",null,null,null,null,"Plains"]
[]
{"$rows_left_out":91}
{"sheet":"Impacts","index":1,"n_rows":47,"n_cols":9,"rows_kept":47,"cut":false,"hidden":false,"merged":[[30,3,30,4],[19,4,19,5],[26,4,26,5],[10,4,10,5],[13,4,13,5],[13,2,13,3],[14,2,14,3],[14,4,14,5],[15,2,15,3],[15,4,15,5],[22,2,22,3],[22,4,22,5]]}
["CDOT Oil & Gas Impacts Calculator - Impact Report"]
["Created by Felsburg Holt & Ullevig for exclusive use by CDOT"]
["v1.2","Last updated on 3/2/2015"]
["Roadway Impacts"]
["ID","Name","Start MP","End MP","Length","Surface","Development Costs ($2014)","Future Pad(s) Production Costs ($2014) / Year","Existing Pad(s) Production\nCosts ($2014) / Year"]
[]
[]
["TOTAL:",null,null,null,{"$f":"SUM(E6:E7)","v":0},null,{"$f":"SUM(G6:G7)","v":0},{"$f":"SUM(H6:H7)","v":0},{"$f":"SUM(I6:I7)","v":0}]
[null,null,null,null,null,null,"Total over years of production:",{"$f":"H8*$D$38","v":0},{"$f":"I8*$E$38","v":0}]
[]
["Total additional roadway costs over life of pad(s):",null,null,null,{"$f":"G8+H9+I9","v":0},null,"($2014)"]
[]
["Bridge Impacts"]
["ID","Structure #","Facility Carried",null,"Feature Intersected",null,"Development Costs ($2014)","Future Pad(s) Production Costs ($2014) / Year","Existing Pad(s) Production\nCosts ($2014) / Year"]
[]
[]
["TOTAL:",null,null,null,null,null,{"$f":"SUM(G15:G16)","v":0},{"$f":"SUM(H15:H16)","v":0},{"$f":"SUM(I15:I16)","v":0}]
[null,null,null,null,null,null,"Total over years of production:",{"$f":"H17*$D$38","v":0},{"$f":"I17*$E$38","v":0}]
[]
["Total additional bridge costs over life of pad(s):",null,null,null,{"$f":"G17+H18+I18","v":0},null,"($2014)"]
{"$rows_left_out":28}
{"sheet":"Options","index":2,"n_rows":8,"n_cols":13,"rows_kept":8,"cut":false,"hidden":true,"merged":[]}
["Lane Surface:","Development Type:","Roads:","Bridges:","CDOT:","Loc:","Functional Class:","Topo:","Deck Overlay:","Joint Type:","Bearing Type:","Replacement:","Pipeline:"]
["Asphalt","Horizontal",1,1,"R1","Urban","Interstate","Plains","HMA/Membrane","No Joints","No Bearings","% Increase","No"]
["Concrete","Vertical",null,null,"R2","Rural","Principal Arterial","Mountains","Polyester","Plug Joint","Type 1","Width/Length","Yes"]
[null,"Recompletion",null,null,"R3",null,"Principal Arterial - Others",null,"No Overlay","0-4 inch","Type 2"]
[null,null,null,null,"R4",null,"Minor Arterial",null,null,"Modular","Type 3"]
[null,null,null,null,"R5",null,"Major Collector"]
[null,null,null,null,null,null,"Minor Collector"]
[null,null,null,null,null,null,"Local"]

{"sheet":"TripGen","index":3,"n_rows":43,"n_cols":6,"rows_kept":43,"cut":false,"hidden":true,"merged":[[0,0,0,5],[14,0,14,5],[17,0,19,0],[20,0,26,0],[27,0,27,2],[39,0,40,0],[6,0,12,0],[3,0,5,0],[38,0,38,5],[13,0,13,2],[28,0,28,5],[30,0,36,0],[37,0,37,2]]}
["Horizontal"]
["Stage","Phase","Pad/Well","Raw Trips","Rounded Trips","Total Trips"]
["Construction","Pad and Road Construction","Pad",87,{"$f":"ROUNDUP(D3/2, 0)*2","v":88},{"$f":"IF(C3=\"Well\", E3*Inputs!$I$82, E3*Inputs!$G$82)","v":88}]
["Drilling","Drilling Rig","Pad",67,{"$f":"ROUNDUP(D4/2, 0)*2","v":68},{"$f":"IF(C4=\"Well\", E4*Inputs!$I$82, E4*Inputs!$G$82)","v":68}]
[null,"Drilling Fluid and Materials","Well",79,80,{"$f":"IF(C5=\"Well\", E5*Inputs!$I$82, E5*Inputs!$G$82)","v":640}]
[null,"Drilling Equipment","Well",65,{"$f":"ROUNDDOWN(D6/2, 0)*2","v":64},{"$f":"IF(C6=\"Well\", E6*Inputs!$I$82, E6*Inputs!$G$82)","v":512}]
["Completion","Completion Rig","Pad",33,{"$f":"ROUNDDOWN(D7/2, 0)*2","v":32},{"$f":"IF(C7=\"Well\", E7*Inputs!$I$82, E7*Inputs!$G$82)","v":32}]
[null,"Completion Fluid and Materials","Well",32,32,{"$f":"IF(C8=\"Well\", E8*Inputs!$I$82, E8*Inputs!$G$82)","v":256}]
[null,"Completion Equipment","Pad",13,{"$f":"ROUNDDOWN(D9/2, 0)*2","v":12},{"$f":"IF(C9=\"Well\", E9*Inputs!$I$82, E9*Inputs!$G$82)","v":12}]
[null,"Fracturing Equipment","Pad",250,250,{"$f":"IF(C10=\"Well\", E10*Inputs!$I$82, E10*Inputs!$G$82)","v":250}]
[null,"Fracture Water","Well",923,{"$f":"ROUNDDOWN(D11/2, 0)*2","v":922},{"$f":"IF(C11=\"Well\", E11*Inputs!$I$82, E11*Inputs!$G$82)","v":7376}]
[null,"Fracture Sand","Well",84,84,{"$f":"IF(C12=\"Well\", E12*Inputs!$I$82, E12*Inputs!$G$82)","v":672}]
[null,"Flowback Water Disposal","Well",308,308,{"$f":"IF(C13=\"Well\", E13*Inputs!$I$82, E13*Inputs!$G$82)","v":2464}]
["Total:",null,null,{"$f":"SUM(D3:D13)","v":1941},{"$f":"SUM(E3:E13)","v":1940},{"$f":"SUM(F3:F13)","v":12370}]
["Vertical"]
["Stage","Phase","Pad/Well","Raw Trips","Rounded Trips","Total Trips"]
["Construction","Pad and Road Construction","Pad",63,{"$f":"ROUND(D17/2, 0)*2","v":64},{"$f":"IF(C17=\"Well\", E17*Inputs!$I$82, E17*Inputs!$G$82)","v":64}]
["Drilling","Drilling Rig","Pad",66,{"$f":"ROUND(D18/2, 0)*2","v":66},{"$f":"IF(C18=\"Well\", E18*Inputs!$I$82, E18*Inputs!$G$82)","v":66}]
[null,"Drilling Fluid and Materials","Well",45,{"$f":"ROUNDDOWN(D19/2, 0)*2","v":44},{"$f":"IF(C19=\"Well\", E19*Inputs!$I$82, E19*Inputs!$G$82)","v":352}]
[null,"Drilling Equipment","Well",59,{"$f":"ROUND(D20/2, 0)*2","v":60},{"$f":"IF(C20=\"Well\", E20*Inputs!$I$82, E20*Inputs!$G$82)","v":480}]
{"$rows_left_out":24}
{"sheet":"TruckImpacts","index":4,"n_rows":66,"n_cols":7,"rows_kept":66,"cut":false,"hidden":true,"merged":[[1,0,1,6],[7,0,7,6],[40,0,40,6],[60,0,60,6]]}
["Truck ID","Group ID","Name","Empty/Full","Dev Type","Flexible","Rigid"]
["Pad Construction"]
["PC1E","EQUIP","Construction Equipment Truck - EMPTY","Empty","Both",8.7999999999999995E-2,9.0999999999999998E-2]
["PC1F","EQUIP","Construction Equipment Truck - LOADED","Full","Both",1.0209999999999999,1.663]
["PC2E","GRAV","Gravel Truck - EMPTY","Empty","Both",0.10199999999999999,0.105]
["PC2F","GRAV","Gravel Truck - LOADED","Full","Both",1.5649999999999999,2.63]
["PC3","WORK","Pickup Truck","Full","Both",3.0000000000000001E-3,3.0000000000000001E-3]
["Development"]
["D1","RIG","Generator House","Full","Both",3.8719999999999999,9.343]
["D2","RIG","Crown Section","Full","Both",8.2460000000000004,15.929]
["D3","RIG","Shaker Tank/Pit","Full","Both",2.5569999999999999,6.0830000000000002]
["D4","RIG","Derrick","Full","Both",8.4770000000000003,18.481000000000002]
["D5","RIG","Suction Tank","Full","Both",2.7730000000000001,5.42]
["D6","RIG","VFD House","Full","Both",3.6669999999999998,8.0370000000000008]
["D7","RIG","Mud Pump","Full","Both",5.5039999999999996,12.781000000000001]
["D8","RIG","Mud Boat","Full","Both",5.2110000000000003,11.345000000000001]
["D9","RIG","Shaker Skid","Full","Both",5.2149999999999999,11.382999999999999]
["D10","RIG","Substructure, etc.","Full","Both",9.0129999999999999,14.914999999999999]
["D11","RIG","Draw Works","Full","Both",6.3250000000000002,15.047000000000001]
["D12","RIG","Hydraulic Unit","Full","Both",3.9889999999999999,8.8350000000000009]
{"$rows_left_out":47}
{"sheet":"TruckDistribution","index":5,"n_rows":163,"n_cols":14,"rows_kept":163,"cut":false,"hidden":true,"merged":[[160,11,160,13],[137,0,156,0],[137,1,138,1],[137,2,138,2],[139,1,142,1],[139,2,142,2],[143,1,146,1],[143,2,146,2],[147,1,150,1],[147,2,150,2],[151,1,152,1],[151,2,152,2],[153,1,154,1],[153,2,154,2],[155,1,156,1],[155,2,156,2],[114,0,133,0],[114,1,115,1],[114,2,115,2],[116,1,119,1],[116,2,119,2],[120,1,123,1],[120,2,123,2],[124,1,127,1],[124,2,127,2],[128,1,129,1],[128,2,129,2],[130,1,131,1],[130,2,131,2],[132,1,133,1],[132,2,133,2],[77,0,81,0],[77,1,81,1],[77,2,81,2],[82,0,113,0],[82,1,100,1],[82,2,100,2],[101,1,107,1],[101,2,107,2],[108,1,113,1],[108,2,113,2],[69,0,73,0],[69,2,73,2],[70,1,71,1],[72,1,73,1],[6,0,37,0],[38,2,39,2],[40,1,43,1],[40,2,43,2],[25,2,31,2],[25,1,31,1],[32,2,37,2],[32,1,37,1],[61,0,65,0],[62,1,63,1],[64,1,65,1],[61,2,65,2],[1,2,5,2],[1,1,5,1],[1,0,5,0],[6,2,24,2],[6,1,24,1],[54,1,55,1],[54,2,55,2],[56,2,57,2],[56,1,57,1],[38,0,57,0],[44,2,47,2],[44,1,47,1],[48,2,51,2],[48,1,51,1],[52,2,53,2],[52,1,53,1],[38,1,39,1]]}
["Stage","Phase","Trips","Truck ID","Group ID","Truck Name","Dir","Base","% Phase","Overall","% Rd","Mod","Flexible ESALs","Rigid ESALs"]
["Construction (Horizontal)","Pad and Road Construction",{"$f":"TripGen!F3","v":88},{"$f":"TruckImpacts!A$3","v":"PC1E"},{"$f":"TruckImpacts!B$3","v":"EQUIP"},{"$f":"TruckImpacts!C$3","v":"Construction Equipment Truck - EMPTY"},"Both",8,9.0909090909090912E-2,{"$f":"I2*C$2","v":8},{"$f":"SUMIF(Inputs!$A$99:$A$109, E2, Inputs!$G$99:$G$109)/100","v":1},{"$f":"ROUND(J2*K2, 0)","v":8},{"$f":"SUMIF(TruckImpacts!$A:$A, $D2, TruckImpacts!F:F)*$L2","v":0.70399999999999996},{"$f":"SUMIF(TruckImpacts!$A:$A, $D2, TruckImpacts!G:G)*$L2","v":0.72799999999999998}]
[null,null,null,{"$f":"TruckImpacts!A$4","v":"PC1F"},{"$f":"TruckImpacts!B$4","v":"EQUIP"},{"$f":"TruckImpacts!C$4","v":"Construction Equipment Truck - LOADED"},"Both",8,9.0909090909090912E-2,{"$f":"I3*C$2","v":8},{"$f":"SUMIF(Inputs!$A$99:$A$109, E3, Inputs!$G$99:$G$109)/100","v":1},{"$f":"ROUND(J3*K3, 0)","v":8},{"$f":"SUMIF(TruckImpacts!$A:$A, $D3, TruckImpacts!F:F)*$L3","v":8.1679999999999993},{"$f":"SUMIF(TruckImpacts!$A:$A, $D3, TruckImpacts!G:G)*$L3","v":13.304}]
[null,null,null,{"$f":"TruckImpacts!A$5","v":"PC2E"},{"$f":"TruckImpacts!B$5","v":"GRAV"},{"$f":"TruckImpacts!C$5","v":"Gravel Truck - EMPTY"},"Out",20,0.22727272727272727,20,{"$f":"SUMIF(Inputs!$A$99:$A$109, E4, Inputs!$G$99:$G$109)/100","v":1},20,{"$f":"SUMIF(TruckImpacts!$A:$A, $D4, TruckImpacts!F:F)*$L4","v":2.04},{"$f":"SUMIF(TruckImpacts!$A:$A, $D4, TruckImpacts!G:G)*$L4","v":2.1}]
[null,null,null,{"$f":"TruckImpacts!A$6","v":"PC2F"},{"$f":"TruckImpacts!B$6","v":"GRAV"},{"$f":"TruckImpacts!C$6","v":"Gravel Truck - LOADED"},"In",20,0.22727272727272727,20,{"$f":"SUMIF(Inputs!$A$99:$A$109, E5, Inputs!$G$99:$G$109)/100","v":1},20,{"$f":"SUMIF(TruckImpacts!$A:$A, $D5, TruckImpacts!F:F)*$L5","v":31.299999999999997},{"$f":"SUMIF(TruckImpacts!$A:$A, $D5, TruckImpacts!G:G)*$L5","v":52.599999999999994}]
[null,null,null,{"$f":"TruckImpacts!A$7","v":"PC3"},{"$f":"TruckImpacts!B$7","v":"WORK"},{"$f":"TruckImpacts!C$7","v":"Pickup Truck"},"Both",32,0.36363636363636365,32,{"$f":"SUMIF(Inputs!$A$99:$A$109, E6, Inputs!$G$99:$G$109)/100","v":1},32,{"$f":"SUMIF(TruckImpacts!$A:$A, $D6, TruckImpacts!F:F)*$L6","v":9.6000000000000002E-2},{"$f":"SUMIF(TruckImpacts!$A:$A, $D6, TruckImpacts!G:G)*$L6","v":9.6000000000000002E-2}]
["Drilling (Horizontal)","Drilling Rig",{"$f":"TripGen!F4","v":68},{"$f":"TruckImpacts!A$9","v":"D1"},{"$f":"TruckImpacts!B$9","v":"RIG"},{"$f":"TruckImpacts!C$9","v":"Generator House"},"Both",6,8.8235294117647065E-2,{"$f":"I7*C$7","v":6},{"$f":"SUMIF(Inputs!$A$99:$A$109, E7, Inputs!$G$99:$G$109)/100","v":1},6,{"$f":"SUMIF(TruckImpacts!$A:$A, $D7, TruckImpacts!F:F)*$L7","v":23.231999999999999},{"$f":"SUMIF(TruckImpacts!$A:$A, $D7, TruckImpacts!G:G)*$L7","v":56.058}]
[null,null,null,{"$f":"TruckImpacts!A$10","v":"D2"},{"$f":"TruckImpacts!B$10","v":"RIG"},{"$f":"TruckImpacts!C$10","v":"Crown Section"},"Both",2,2.9411764705882353E-2,{"$f":"I8*C$7","v":2},{"$f":"SUMIF(Inputs!$A$99:$A$109, E8, Inputs!$G$99:$G$109)/100","v":1},2,{"$f":"SUMIF(TruckImpacts!$A:$A, $D8, TruckImpacts!F:F)*$L8","v":16.492000000000001},{"$f":"SUMIF(TruckImpacts!$A:$A, $D8, TruckImpacts!G:G)*$L8","v":31.858000000000001}]
[null,null,null,{"$f":"TruckImpacts!A$11","v":"D3"},{"$f":"TruckImpacts!B$11","v":"RIG"},{"$f":"TruckImpacts!C$11","v":"Shaker Tank/Pit"},"Both",2,2.9411764705882353E-2,2,{"$f":"SUMIF(Inputs!$A$99:$A$109, E9, Inputs!$G$99:$G$109)/100","v":1},2,{"$f":"SUMIF(TruckImpacts!$A:$A, $D9, TruckImpacts!F:F)*$L9","v":5.1139999999999999},{"$f":"SUMIF(TruckImpacts!$A:$A, $D9, TruckImpacts!G:G)*$L9","v":12.166}]
[null,null,null,{"$f":"TruckImpacts!A$12","v":"D4"},{"$f":"TruckImpacts!B$12","v":"RIG"},{"$f":"TruckImpacts!C$12","v":"Derrick"},"Both",2,2.9411764705882353E-2,2,{"$f":"SUMIF(Inputs!$A$99:$A$109, E10, Inputs!$G$99:$G$109)/100","v":1},2,{"$f":"SUMIF(TruckImpacts!$A:$A, $D10, TruckImpacts!F:F)*$L10","v":16.954000000000001},{"$f":"SUMIF(TruckImpacts!$A:$A, $D10, TruckImpacts!G:G)*$L10","v":36.962000000000003}]
[null,null,null,{"$f":"TruckImpacts!A$13","v":"D5"},{"$f":"TruckImpacts!B$13","v":"RIG"},{"$f":"TruckImpacts!C$13","v":"Suction Tank"},"Both",2,2.9411764705882353E-2,2,{"$f":"SUMIF(Inputs!$A$99:$A$109, E11, Inputs!$G$99:$G$109)/100","v":1},2,{"$f":"SUMIF(TruckImpacts!$A:$A, $D11, TruckImpacts!F:F)*$L11","v":5.5460000000000003},{"$f":"SUMIF(TruckImpacts!$A:$A, $D11, TruckImpacts!G:G)*$L11","v":10.84}]
[null,null,null,{"$f":"TruckImpacts!A$14","v":"D6"},{"$f":"TruckImpacts!B$14","v":"RIG"},{"$f":"TruckImpacts!C$14","v":"VFD House"},"Both",2,2.9411764705882353E-2,2,{"$f":"SUMIF(Inputs!$A$99:$A$109, E12, Inputs!$G$99:$G$109)/100","v":1},2,{"$f":"SUMIF(TruckImpacts!$A:$A, $D12, TruckImpacts!F:F)*$L12","v":7.3339999999999996},{"$f":"SUMIF(TruckImpacts!$A:$A, $D12, TruckImpacts!G:G)*$L12","v":16.074000000000002}]
[null,null,null,{"$f":"TruckImpacts!A$15","v":"D7"},{"$f":"TruckImpacts!B$15","v":"RIG"},{"$f":"TruckImpacts!C$15","v":"Mud Pump"},"Both",4,5.8823529411764705E-2,4,{"$f":"SUMIF(Inputs!$A$99:$A$109, E13, Inputs!$G$99:$G$109)/100","v":1},4,{"$f":"SUMIF(TruckImpacts!$A:$A, $D13, TruckImpacts!F:F)*$L13","v":22.015999999999998},{"$f":"SUMIF(TruckImpacts!$A:$A, $D13, TruckImpacts!G:G)*$L13","v":51.124000000000002}]
[null,null,null,{"$f":"TruckImpacts!A$16","v":"D8"},{"$f":"TruckImpacts!B$16","v":"RIG"},{"$f":"TruckImpacts!C$16","v":"Mud Boat"},"Both",2,2.9411764705882353E-2,2,{"$f":"SUMIF(Inputs!$A$99:$A$109, E14, Inputs!$G$99:$G$109)/100","v":1},2,{"$f":"SUMIF(TruckImpacts!$A:$A, $D14, TruckImpacts!F:F)*$L14","v":10.422000000000001},{"$f":"SUMIF(TruckImpacts!$A:$A, $D14, TruckImpacts!G:G)*$L14","v":22.69}]
[null,null,null,{"$f":"TruckImpacts!A$17","v":"D9"},{"$f":"TruckImpacts!B$17","v":"RIG"},{"$f":"TruckImpacts!C$17","v":"Shaker Skid"},"Both",2,2.9411764705882353E-2,2,{"$f":"SUMIF(Inputs!$A$99:$A$109, E15, Inputs!$G$99:$G$109)/100","v":1},2,{"$f":"SUMIF(TruckImpacts!$A:$A, $D15, TruckImpacts!F:F)*$L15","v":10.43},{"$f":"SUMIF(TruckImpacts!$A:$A, $D15, TruckImpacts!G:G)*$L15","v":22.765999999999998}]
[null,null,null,{"$f":"TruckImpacts!A$18","v":"D10"},{"$f":"TruckImpacts!B$18","v":"RIG"},{"$f":"TruckImpacts!C$18","v":"Substructure, etc."},"Both",10,0.14705882352941177,10,{"$f":"SUMIF(Inputs!$A$99:$A$109, E16, Inputs!$G$99:$G$109)/100","v":1},10,{"$f":"SUMIF(TruckImpacts!$A:$A, $D16, TruckImpacts!F:F)*$L16","v":90.13},{"$f":"SUMIF(TruckImpacts!$A:$A, $D16, TruckImpacts!G:G)*$L16","v":149.14999999999998}]
[null,null,null,{"$f":"TruckImpacts!A$19","v":"D11"},{"$f":"TruckImpacts!B$19","v":"RIG"},{"$f":"TruckImpacts!C$19","v":"Draw Works"},"Both",2,2.9411764705882353E-2,2,{"$f":"SUMIF(Inputs!$A$99:$A$109, E17, Inputs!$G$99:$G$109)/100","v":1},2,{"$f":"SUMIF(TruckImpacts!$A:$A, $D17, TruckImpacts!F:F)*$L17","v":12.65},{"$f":"SUMIF(TruckImpacts!$A:$A, $D17, TruckImpacts!G:G)*$L17","v":30.094000000000001}]
[null,null,null,{"$f":"TruckImpacts!A$20","v":"D12"},{"$f":"TruckImpacts!B$20","v":"RIG"},{"$f":"TruckImpacts!C$20","v":"Hydraulic Unit"},"Both",2,2.9411764705882353E-2,2,{"$f":"SUMIF(Inputs!$A$99:$A$109, E18, Inputs!$G$99:$G$109)/100","v":1},2,{"$f":"SUMIF(TruckImpacts!$A:$A, $D18, TruckImpacts!F:F)*$L18","v":7.9779999999999998},{"$f":"SUMIF(TruckImpacts!$A:$A, $D18, TruckImpacts!G:G)*$L18","v":17.670000000000002}]
[null,null,null,{"$f":"TruckImpacts!A$21","v":"D13"},{"$f":"TruckImpacts!B$21","v":"RIG"},{"$f":"TruckImpacts!C$21","v":"Choke Manifold"},"Both",2,2.9411764705882353E-2,2,{"$f":"SUMIF(Inputs!$A$99:$A$109, E19, Inputs!$G$99:$G$109)/100","v":1},2,{"$f":"SUMIF(TruckImpacts!$A:$A, $D19, TruckImpacts!F:F)*$L19","v":12.528},{"$f":"SUMIF(TruckImpacts!$A:$A, $D19, TruckImpacts!G:G)*$L19","v":20.872}]
[null,null,null,{"$f":"TruckImpacts!A$22","v":"D14"},{"$f":"TruckImpacts!B$22","v":"RIG"},{"$f":"TruckImpacts!C$22","v":"MCC House"},"Both",2,2.9411764705882353E-2,2,{"$f":"SUMIF(Inputs!$A$99:$A$109, E20, Inputs!$G$99:$G$109)/100","v":1},2,{"$f":"SUMIF(TruckImpacts!$A:$A, $D20, TruckImpacts!F:F)*$L20","v":14.858000000000001},{"$f":"SUMIF(TruckImpacts!$A:$A, $D20, TruckImpacts!G:G)*$L20","v":33.415999999999997}]
{"$rows_left_out":144}
{"sheet":"RoadwayConstants","index":6,"n_rows":141,"n_cols":13,"rows_kept":141,"cut":false,"hidden":true,"merged":[]}
["LOC","TOPO","CLASS","REGION","Reliability","Std Normal Deviate","Resilient Modulus","K-Value","Serv Loss","ESALs HMA","ESALs PCCP","SN HMA","Thick PCCP"]
["Urban","Plains","Interstate","R1",95,-1.645,7800,125,2,41225509.267375253,69162413.865162417,5.93,13.25]
["Urban","Mountains","Interstate","R1",95,-1.645,25000,250,2]
["Rural","Plains","Interstate","R1",95,-1.645,7800,125,2,21123879.997628432,33343201.953071631,5.43,11.75]
["Rural","Mountains","Interstate","R1",95,-1.645,25000,250,2,16037300.14420457,24669916.75360262,3.7,11]
["Urban","Plains","Principal Arterial","R1",95,-1.645,7800,125,2,14904244.57267868,23204954.611675631,5.18,11]
["Urban","Mountains","Principal Arterial","R1",95,-1.645,25000,250,2]
["Rural","Plains","Principal Arterial","R1",95,-1.645,7800,125,2,13119668.108374091,null,5.09]
["Rural","Mountains","Principal Arterial","R1",95,-1.645,25000,250,2]
["Urban","Plains","Principal Arterial - Others","R1",95,-1.645,7800,125,2,5137528.6915997174,8403349.8139379639,4.47,9.5]
["Urban","Mountains","Principal Arterial - Others","R1",95,-1.645,25000,250,2]
["Rural","Plains","Principal Arterial - Others","R1",95,-1.645,7800,125,2,3556295.1776499678,7157386.1246911399,4.24,9.25]
["Rural","Mountains","Principal Arterial - Others","R1",95,-1.645,25000,250,2,3307053.2311240924,8878967.5461789295,2.77,9.25]
["Urban","Plains","Minor Arterial","R1",95,-1.645,7800,125,2,3231454.4176139506,5419470.5973551767,4.18,8.75]
["Urban","Mountains","Minor Arterial","R1",95,-1.645,25000,250,2,1550946.3672458443,829801.14986721799,2.46,6]
["Rural","Plains","Minor Arterial","R1",95,-1.645,7800,125,2,2060232.3584799888,null,3.91]
["Rural","Mountains","Minor Arterial","R1",95,-1.645,25000,250,2,1406336.353371328,4640338.5105271963,2.42,8.25]
["Urban","Plains","Major Collector","R1",90,-1.282,7800,125,2,740773.12979968486,null,3.16]
["Urban","Mountains","Major Collector","R1",90,-1.282,25000,250,2]
["Rural","Plains","Major Collector","R1",90,-1.282,7800,125,2,1679944.531653228,null,3.59]
{"$rows_left_out":122}
{"sheet":"RoadwayCalcs","index":7,"n_rows":3,"n_cols":43,"rows_kept":3,"cut":false,"hidden":true,"merged":[]}
["ID","Name","Start MP","End MP","LOC","TOPO","CLASS","REGION","Surface","Length","Width","Lanes","D#","Dev ESALs","Ex SI","Design ESALs","Ex Yr ESALs","Combo Dev ESALs","Terminal SI","Reliab %","SND\n ZR","Resilient Modulus","AASHTO Eq. - Ex.","Required SN - Ex.","Dev AASHTO\nEq. - Combo","Dev Required SN - Combo","Dev SN Deficiency","Dev Overlay In.","Development Improvement $","Future Prod ESALs","Combo Prod ESALs","Prod AASHTO\nEq. - Combo","Prod Required SN - Combo","Prod SN Deficiency","Prod Overlay In.","Ft. Production Improvement $","Existing Prod ESALs","Combo Prod ESALs","Prod AASHTO\nEq. - Combo","Prod Required SN - Combo","Prod SN Deficiency","Prod Overlay In.","Ex. Production Improvement $"]
[null,null,null,null,null,null,null,null,null,null,null,null,null,{"$f":"IF(I2=\"Asphalt\", TruckDistribution!$M$163, IF(I2=\"Concrete\", TruckDistribution!$N$163, 0))","v":0},{"$f":"SUMIF(OtherRoadway!A:A, ROUND(M2, 0), IF(COUNTIF(OtherRoadway!D:D, G2)>0, OtherRoadway!B:B, OtherRoadway!C:C))+IF(ROUND(M2, 0) = 0, S2+0.00001, IF(ROUND(M2, 0) > 10, 4.5, 0))","v":1.0000000000000001E-5},{"$f":"SUMIFS(IF(I2=\"Asphalt\", RoadwayConstants!J:J, IF(I2=\"Concrete\", RoadwayConstants!K:K,  RoadwayConstants!Z:Z)), RoadwayConstants!A:A, E2, RoadwayConstants!B:B, F2, RoadwayConstants!C:C, G2, RoadwayConstants!D:D, H2)","v":0},{"$f":"P2/20","v":0},{"$f":"Q2+N2","v":0},{"$f":"SUMIFS(RoadwayConstants!I:I, RoadwayConstants!A:A, E2, RoadwayConstants!B:B, F2, RoadwayConstants!C:C, G2, RoadwayConstants!D:D, H2)","v":0},{"$f":"SUMIFS(RoadwayConstants!E:E, RoadwayConstants!A:A, E2, RoadwayConstants!B:B, F2, RoadwayConstants!C:C, G2, RoadwayConstants!D:D, H2)","v":0},{"$f":"SUMIFS(RoadwayConstants!F:F, RoadwayConstants!A:A, E2, RoadwayConstants!B:B, F2, RoadwayConstants!C:C, G2, RoadwayConstants!D:D, H2)","v":0},{"$f":"SUMIFS(RoadwayConstants!G:G, RoadwayConstants!A:A, E2, RoadwayConstants!B:B, F2, RoadwayConstants!C:C, G2, RoadwayConstants!D:D, H2)","v":0},{"$f":"LOG10(Q2)-U2*0.44-9.36*LOG10(X2+1)+0.2-(LOG10((O2-S2)/(4.2-1.5))/(0.4+(1094/((X2+1)^5.19))))-2.32*LOG10(V2)+8.07","v":{"$error":"#NUM!"}},null,{"$f":"LOG10(R2)-U2*0.44-9.36*LOG10(Z2+1)+0.2-(LOG10((O2-S2)/(4.2-1.5))/(0.4+(1094/((Z2+1)^5.19))))-2.32*LOG10(V2)+8.07","v":{"$error":"#NUM!"}},null,{"$f":"Z2-X2","v":0},{"$f":"AA2/0.44","v":0},{"$f":"ROUNDUP(IF(I2=\"Asphalt\", 0.055*AB2*J2*K2*5280*(1/9)*OtherRoadway!$G$2, IF(I2=\"Concrete\", (N2/P2)*J2*L2*OtherRoadway!$G$3, 0)), -2)","v":0},{"$f":"IF($I2=\"Asphalt\", TruckDistribution!$M$67, IF($I2=\"Concrete\", TruckDistribution!$N$67, 0))","v":0},{"$f":"AD2+$Q2","v":0},{"$f":"LOG10(AE2)-U2*0.44-9.36*LOG10(AG2+1)+0.2-(LOG10((O2-S2)/(4.2-1.5))/(0.4+(1094/((AG2+1)^5.19))))-2.32*LOG10(V2)+8.07","v":{"$error":"#NUM!"}},null,{"$f":"AG2-$X2","v":0},{"$f":"AH2/0.44","v":0},{"$f":"ROUNDUP(IF(I2=\"Asphalt\", 0.055*AI2*J2*K2*5280*(1/9)*OtherRoadway!$G$2, IF(I2=\"Concrete\", (AD2/P2)*J2*L2*OtherRoadway!$G$3, 0)), -2)","v":0},{"$f":"IF($I2=\"Asphalt\", TruckDistribution!$M$75, IF($I2=\"Concrete\", TruckDistribution!$N$75, 0))","v":0},{"$f":"AK2+$Q2","v":0},{"$f":"LOG10(AL2)-U2*0.44-9.36*LOG10(AN2+1)+0.2-(LOG10((O2-S2)/(4.2-1.5))/(0.4+(1094/((AN2+1)^5.19))))-2.32*LOG10(V2)+8.07","v":{"$error":"#NUM!"}},null,{"$f":"AN2-$X2","v":0},{"$f":"AO2/0.44","v":0},{"$f":"ROUNDUP(IF(I2=\"Asphalt\", 0.055*AP2*J2*K2*5280*(1/9)*OtherRoadway!$G$2, IF(I2=\"Concrete\", (AK2/P2)*J2*L2*OtherRoadway!$G$3, 0)), -2)","v":0}]
["END"]

{"sheet":"BridgeConstants","index":8,"n_rows":5,"n_cols":16,"rows_kept":5,"cut":false,"hidden":true,"merged":[]}
["Deck","Years","$/SF","$/SF/Yr","Joints","Years","$/LF","$/LF/Yr","Bearings","Years","$/Each","$/Each/Yr","Replacement","Years","$/SF","$/SF/Yr"]
["Replacement",{"$f":"IF(Inputs!G49=\"No Overlay\", 30, 40)","v":40},42,{"$f":"C2/B2","v":1.05},"No Joints",0,0,0,"No Bearings",0,0,0,"Replacement",75,120,{"$f":"O2/N2","v":1.6}]
["HMA/Membrane",15,8,{"$f":"C3/B3","v":0.53333333333333333},"Plug Joint",15,400,{"$f":"G3/F3","v":26.666666666666668},"Type 1",30,5600,{"$f":"K3/J3","v":186.66666666666666}]
["Polyester",25,16,{"$f":"C4/B4","v":0.64},"0-4 inch",15,560,{"$f":"G4/F4","v":37.333333333333336},"Type 2",30,8000,{"$f":"K4/J4","v":266.66666666666669}]
["No Overlay",0,0,0,"Modular",25,3600,{"$f":"G5/F5","v":144},"Type 3",30,12000,{"$f":"K5/J5","v":400}]

{"sheet":"BridgeCalcs","index":9,"n_rows":3,"n_cols":38,"rows_kept":3,"cut":false,"hidden":true,"merged":[]}
["ID","Structure #","Facility Carried","Feature Intersected","Baseline ADTT","Width","Length","Overlay","Joint\nType","Joints","Skew","Bearing\nType","Bearings","Replacement\nMethod","%\nIncrease","Repl.\nWidth","Repl.\nLength","Total Deck Area (SF)","Total Joint Length (LF)","Replacement Bridge Area (SF)","Dev\nO&G Trucks","Dev\nTrucks/Day","% Dev\nImpact","Deck Repl. $","Deck Overlay $","Joints Repl. $","Bearings Repl. $","Repl. Bridge $"," Total Bridge $","O&G Dev $","Ft. Prod\nO&G Trucks","Ft. Prod\nTrucks/Day","% Ft. Prod\nImpact","O&G Ft. Prod $/yr","Ft. Prod\nO&G Trucks","Ft. Prod\nTrucks/Day","% Ft. Prod\nImpact","O&G Ft. Prod $/yr"]
[null,null,null,null,null,null,null,null,null,null,null,null,null,null,null,null,null,{"$f":"F2*G2","v":0},{"$f":"J2*F2/COS(K2*PI()/180)","v":0},{"$f":"IF(N2=\"% Increase\", R2*(1+O2), P2*Q2)","v":0},{"$f":"TruckDistribution!$L$163","v":12370},{"$f":"IF(Inputs!$G$87 = 0, U2/30, U2/Inputs!$G$87)","v":412.33333333333331},{"$f":"IF($E2=0,1,V2/(V2+$E2))","v":1},{"$f":"BridgeConstants!$D$2*R2","v":0},{"$f":"SUMIF(BridgeConstants!A:A, H2, BridgeConstants!D:D)*R2","v":0},{"$f":"SUMIF(BridgeConstants!E:E, I2, BridgeConstants!H:H)*S2","v":0},{"$f":"SUMIF(BridgeConstants!I:I, L2, BridgeConstants!L:L)*M2","v":0},{"$f":"BridgeConstants!$P$2*T2","v":0},{"$f":"SUM(X2:AB2)","v":0},{"$f":"ROUND(AC2*W2, -2)","v":0},{"$f":"TruckDistribution!$L$67","v":560},{"$f":"AE2/365","v":1.5342465753424657},{"$f":"IF($E2=0,1,AF2/(AF2+$E2))","v":1},{"$f":"ROUND($AC2*AG2, -2)","v":0},{"$f":"TruckDistribution!$L$75","v":0},{"$f":"AI2/365","v":0},{"$f":"IF($E2=0,1,AJ2/(AJ2+$E2))","v":1},{"$f":"ROUND($AC2*AK2, -2)","v":0}]
["END"]

{"sheet":"OtherRoadway","index":10,"n_rows":11,"n_cols":8,"rows_kept":11,"cut":false,"hidden":true,"merged":[]}
["#","SI-Maj","SI-Min","Class-Maj","Class-Min","Surface","Cost","Unit"]
[1,2.7,3,"Interstate","Minor Collector","Asphalt",155,"Ton"]
[2,2.7,3,"Principal Arterial","Local","Concrete",572725,"Lane/Mile"]
[3,3.3,3.5,"Principal Arterial - Others"]
[4,3.3,3.5,"Minor Arterial"]
[5,3.3,3.5,"Major Collector"]
[6,3.3,3.5]
[7,3.3,3.5]
[8,3.3,3.5]
[9,4,4]
[10,4,4]